Reaction Details
TargetCannabinoid receptor 2
LigandBDBM50399529
Substrate/Competitorn/a
Meas. Tech.ChEMBL_878264 (CHEMBL2185469)
Ki 4645±n/a nM
Citation Fulp, ABortoff, KZhang, YSeltzman, HMathews, JSnyder, RFennell, TMaitra, R Diphenyl purine derivatives as peripherally selective cannabinoid receptor 1 antagonists. J Med Chem55:10022-32 (2012) 
 
Cannabinoid receptor 2
Name:Cannabinoid receptor 2
Type:G Protein-Coupled Receptor (GPCR)
Mol. Mass.:39690.94
Organism:Homo sapiens (Human)
Description:P34972
Residue:360
BDBM50399529
NameBDBM50399529
Synonyms:CHEMBL2180220 | US9187480, 1-{1-[8-(2-chlorophenyl)-9-(4-chlorophenyl)-9H-purin-6-yl]-4-phenylpiperidin-4-yl}-3-ethylurea
TypeSmall organic molecule
Emp. Form.C31H29Cl2N7O
Mol. Mass.586.514
SMILESCCNC(=O)NC1(CCN(CC1)c1ncnc2n(c(nc12)-c1ccccc1Cl)-c1ccc(Cl)cc1)c1ccccc1