Reaction Details
TargetCannabinoid receptor 1
LigandBDBM50399531
Substrate/Competitorn/a
Meas. Tech.ChEMBL_878265 (CHEMBL2185470)
Ki 6.2±n/a nM
Citation Fulp, ABortoff, KZhang, YSeltzman, HMathews, JSnyder, RFennell, TMaitra, R Diphenyl purine derivatives as peripherally selective cannabinoid receptor 1 antagonists. J Med Chem55:10022-32 (2012) 
 
Cannabinoid receptor 1
Name:Cannabinoid receptor 1
Type:G Protein-Coupled Receptor (GPCR)
Mol. Mass.:52868.96
Organism:Homo sapiens (Human)
Description:P21554
Residue:472
BDBM50399531
NameBDBM50399531
Synonyms:CHEMBL2180218
TypeSmall organic molecule
Emp. Form.C29H26Cl2N6O2S
Mol. Mass.593.527
SMILESCS(=O)(=O)NC1(CCN(CC1)c1ncnc2n(c(nc12)-c1ccccc1Cl)-c1ccc(Cl)cc1)c1ccccc1