Reaction Details
TargetVoltage-dependent N-type calcium channel subunit alpha-1B
LigandBDBM50399548
Substrate/Competitorn/a
Meas. Tech.ChEMBL_878508 (CHEMBL2187793)
IC50 300±n/a nM
Citation Shao, PPYe, FChakravarty, PKVarughese, DJHerrington, JBDai, GBugianesi, RMHaedo, RJSwensen, AMWarren, VASmith, MMGarcia, MLMcManus, OBLyons, KALi, XGreen, MJochnowitz, NMcGowan, EMistry, SSun, SYAbbadie, CKaczorowski, GJDuffy, JL Aminopiperidine sulfonamide Cav2.2 channel inhibitors for the treatment of chronic pain. J Med Chem55:9847-55 (2012) 
 
Voltage-dependent N-type calcium channel subunit alpha-1B
Name:Voltage-dependent N-type calcium channel subunit alpha-1B
Type:Enzyme
Mol. Mass.:262548.16
Organism:Homo sapiens (Human)
Description:Q00975
Residue:2339
BDBM50399548
NameBDBM50399548
Synonyms:CHEMBL2180896
TypeSmall organic molecule
Emp. Form.C23H22F6N2O4S
Mol. Mass.536.487
SMILESFC(F)(F)Oc1ccc(cc1)C(=O)N1CCC(CC1)N(C1CC1)S(=O)(=O)c1cccc(c1)C(F)(F)F