Reaction Details
TargetCytochrome P450 3A4
LigandBDBM50399544
Substrate/Competitorn/a
Meas. Tech.ChEMBL_878389 (CHEMBL2186895)
IC50 5100±n/a nM
Citation Shao, PPYe, FChakravarty, PKVarughese, DJHerrington, JBDai, GBugianesi, RMHaedo, RJSwensen, AMWarren, VASmith, MMGarcia, MLMcManus, OBLyons, KALi, XGreen, MJochnowitz, NMcGowan, EMistry, SSun, SYAbbadie, CKaczorowski, GJDuffy, JL Aminopiperidine sulfonamide Cav2.2 channel inhibitors for the treatment of chronic pain. J Med Chem55:9847-55 (2012) 
 
Cytochrome P450 3A4
Name:Cytochrome P450 3A4
Type:Enzyme
Mol. Mass.:57349.57
Organism:Homo sapiens (Human)
Description:n/a
Residue:503
BDBM50399544
NameBDBM50399544
Synonyms:CHEMBL2180905
TypeSmall organic molecule
Emp. Form.C23H24F4N2O5S2
Mol. Mass.548.571
SMILESCS(=O)(=O)c1ccc(F)cc1C(=O)N1CCC(CC1)N(C1CC1)S(=O)(=O)c1cccc(c1)C(F)(F)F