Reaction Details
TargetDelta-type opioid receptor
LigandBDBM85731
Substrate/Competitorn/a
Meas. Tech.ChEMBL_878565 (CHEMBL2188650)
IC50 23.1±n/a nM
Citation Novoa, AVan Dorpe, SWynendaele, ESpetea, MBracke, NStalmans, SBetti, CChung, NNLemieux, CZuegg, JCooper, MATourwé, DDe Spiegeleer, BSchiller, PWBallet, S Variation of the net charge, lipophilicity, and side chain flexibility in Dmt(1)-DALDA: Effect on Opioid Activity and Biodistribution. J Med Chem55:9549-61 (2012) 
 
Delta-type opioid receptor
Name:Delta-type opioid receptor
Type:Enzyme Catalytic Domain
Mol. Mass.:40577.25
Organism:MOUSE
Description:P32300
Residue:372
BDBM85731
NameBDBM85731
Synonyms:[Dmt1]DALDA
TypeSmall organic molecule
Emp. Form.C32H49N9O5
Mol. Mass.639.7888
SMILES[#6]-c1cc(-[#8])cc(-[#6])c1-[#6]-[#6@H](-[#7])-[#6](=O)-[#7]-[#6@H](-[#6]-[#6]-[#6]\[#7]=[#6](\[#7])-[#7])-[#6](=O)-[#7]-[#6@@H](-[#6]-c1ccccc1)-[#6](=O)-[#7]-[#6@@H](-[#6]-[#6]-[#6]-[#6]-[#7])-[#6](-[#7])=O