Reaction Details
TargetMu-type opioid receptor
LigandBDBM50399635
Substrate/Competitorn/a
Meas. Tech.ChEMBL_878566 (CHEMBL2188651)
IC50 49±n/a nM
Citation Novoa, AVan Dorpe, SWynendaele, ESpetea, MBracke, NStalmans, SBetti, CChung, NNLemieux, CZuegg, JCooper, MATourwé, DDe Spiegeleer, BSchiller, PWBallet, S Variation of the net charge, lipophilicity, and side chain flexibility in Dmt(1)-DALDA: Effect on Opioid Activity and Biodistribution. J Med Chem55:9549-61 (2012) 
 
Mu-type opioid receptor
Name:Mu-type opioid receptor
Type:Enzyme Catalytic Domain
Mol. Mass.:11165.58
Organism:GUINEA PIG
Description:P97266
Residue:98
BDBM50399635
NameBDBM50399635
Synonyms:CHEMBL2181192
TypeSmall organic molecule
Emp. Form.C33H48N8O6
Mol. Mass.652.7842
SMILESCc1cc(O)cc(C)c1C[C@H](N)C(=O)N[C@H](CCCNC(N)=O)C(=O)N[C@H]1Cc2ccccc2CN([C@@H](CCCCN)C(N)=O)C1=O