Reaction Details
TargetDelta-type opioid receptor
LigandBDBM50399639
Substrate/Competitorn/a
Meas. Tech.ChEMBL_878638 (CHEMBL2189108)
Ki 16±n/a nM
Citation Novoa, AVan Dorpe, SWynendaele, ESpetea, MBracke, NStalmans, SBetti, CChung, NNLemieux, CZuegg, JCooper, MATourwé, DDe Spiegeleer, BSchiller, PWBallet, S Variation of the net charge, lipophilicity, and side chain flexibility in Dmt(1)-DALDA: Effect on Opioid Activity and Biodistribution. J Med Chem55:9549-61 (2012) 
 
Delta-type opioid receptor
Name:Delta-type opioid receptor
Type:G Protein-Coupled Receptor (GPCR)
Mol. Mass.:40465.04
Organism:Rattus norvegicus (rat)
Description:Competition binding assays were using CHO-K1 cell membranes expressing the opioid receptor.
Residue:372
BDBM50399639
NameBDBM50399639
Synonyms:CHEMBL2181197
TypeSmall organic molecule
Emp. Form.C33H50N8O5
Mol. Mass.638.8007
SMILES[#6]-[#6]-[#6]-[#6]-[#6@H](-[#7](-[#6])-[#6](=O)-[#6@H](-[#6]-c1ccccc1)-[#7]-[#6](=O)-[#6@@H](-[#6]-[#6]-[#6]\[#7]=[#6](/[#7])-[#7])-[#7]-[#6](=O)-[#6@@H](-[#7])-[#6]-c1c(-[#6])cc(-[#8])cc1-[#6])-[#6](-[#7])=O