Reaction Details
TargetMu-type opioid receptor
LigandBDBM50399634
Substrate/Competitorn/a
Meas. Tech.ChEMBL_878639 (CHEMBL2189109)
Ki 0.93±n/a nM
Citation Novoa, AVan Dorpe, SWynendaele, ESpetea, MBracke, NStalmans, SBetti, CChung, NNLemieux, CZuegg, JCooper, MATourwé, DDe Spiegeleer, BSchiller, PWBallet, S Variation of the net charge, lipophilicity, and side chain flexibility in Dmt(1)-DALDA: Effect on Opioid Activity and Biodistribution. J Med Chem55:9549-61 (2012) 
 
Mu-type opioid receptor
Name:Mu-type opioid receptor
Type:G Protein-Coupled Receptor (GPCR)
Mol. Mass.:44503.11
Organism:Rattus norvegicus (rat)
Description:Competition binding assays were carried out using membrane preparations from transfected HN9.10 cells that constitutively expressed the mu opioid receptor.
Residue:398
BDBM50399634
NameBDBM50399634
Synonyms:CHEMBL2181191
TypeSmall organic molecule
Emp. Form.C33H47N7O6
Mol. Mass.637.7696
SMILESCCCC[C@H](N1Cc2ccccc2C[C@H](NC(=O)[C@@H](CCCNC(N)=O)NC(=O)[C@@H](N)Cc2c(C)cc(O)cc2C)C1=O)C(N)=O