Reaction Details
TargetMu-type opioid receptor
LigandBDBM50399637
Substrate/Competitorn/a
Meas. Tech.ChEMBL_878639 (CHEMBL2189109)
Ki 2.92±n/a nM
Citation Novoa, AVan Dorpe, SWynendaele, ESpetea, MBracke, NStalmans, SBetti, CChung, NNLemieux, CZuegg, JCooper, MATourwé, DDe Spiegeleer, BSchiller, PWBallet, S Variation of the net charge, lipophilicity, and side chain flexibility in Dmt(1)-DALDA: Effect on Opioid Activity and Biodistribution. J Med Chem55:9549-61 (2012) 
 
Mu-type opioid receptor
Name:Mu-type opioid receptor
Type:G Protein-Coupled Receptor (GPCR)
Mol. Mass.:44503.11
Organism:Rattus norvegicus (rat)
Description:Competition binding assays were carried out using membrane preparations from transfected HN9.10 cells that constitutively expressed the mu opioid receptor.
Residue:398
BDBM50399637
NameBDBM50399637
Synonyms:CHEMBL2181195
TypeSmall organic molecule
Emp. Form.C33H49N7O6
Mol. Mass.639.7855
SMILESCCCC[C@H](N(C)C(=O)[C@H](Cc1ccccc1)NC(=O)[C@@H](CCCNC(N)=O)NC(=O)[C@@H](N)Cc1c(C)cc(O)cc1C)C(N)=O