Reaction Details
TargetProprotein convertase subtilisin/kexin type 6
LigandBDBM50399747
Substrate/Competitorn/a
Meas. Tech.ChEMBL_877191 (CHEMBL2187699)
pH6.5±n/a
Ki 19±n/a nM
Commentsextracted
Citation Levesque, CFugère, MKwiatkowska, ACouture, FDesjardins, RRouthier, SMoussette, PPrahl, ALammek, BAppel, JRHoughten, RAD'Anjou, FDory, YLNeugebauer, WDay, R The Multi-Leu peptide inhibitor discriminates between PACE4 and furin and exhibits antiproliferative effects on prostate cancer cells. J Med Chem55:10501-11 (2012) 
 
Proprotein convertase subtilisin/kexin type 6
Name:Proprotein convertase subtilisin/kexin type 6
Type:PROTEIN
Mol. Mass.:106442.22
Organism:Homo sapiens (Human)
Description:ChEMBL_1290742
Residue:969
BDBM50399747
NameBDBM50399747
Synonyms:CHEMBL2179832
TypeSmall organic molecule
Emp. Form.C65H126N16O17
Mol. Mass.1403.7929
SMILES[#6]-[#6](-[#6])-[#6]-[#6@H](-[#7]-[#6]-[#6]-[#8]-[#6]-[#6]-[#8]-[#6]-[#6]-[#8]-[#6]-[#6]-[#8]-[#6]-[#6]-[#8]-[#6]-[#6]-[#8]-[#6]-[#6]-[#8]-[#6]-[#6]-[#8]-[#6](-[#6])=O)-[#6](=O)-[#7]-[#6@@H](-[#6]-[#6](-[#6])-[#6])-[#6](=O)-[#7]-[#6@@H](-[#6]-[#6](-[#6])-[#6])-[#6](=O)-[#7]-[#6@@H](-[#6]-[#6](-[#6])-[#6])-[#6](=O)-[#7]-[#6@@H](-[#6]-[#6]-[#6]\[#7]=[#6](/[#7])-[#7])-[#6](=O)-[#7]-[#6@@H](-[#6](-[#6])-[#6])-[#6](=O)-[#7]-[#6@@H](-[#6]-[#6]-[#6]-[#6]-[#7])-[#6](=O)-[#7]-[#6@@H](-[#6]-[#6]-[#6]\[#7]=[#6](/[#7])-[#7])-[#6](-[#7])=O