Reaction Details
TargetFurin
LigandBDBM50399751
Substrate/Competitorn/a
Meas. Tech.ChEMBL_877187 (CHEMBL2187695)
pH7.5±n/a
Ki 5.3±n/a nM
Commentsextracted
Citation Levesque, CFugère, MKwiatkowska, ACouture, FDesjardins, RRouthier, SMoussette, PPrahl, ALammek, BAppel, JRHoughten, RAD'Anjou, FDory, YLNeugebauer, WDay, R The Multi-Leu peptide inhibitor discriminates between PACE4 and furin and exhibits antiproliferative effects on prostate cancer cells. J Med Chem55:10501-11 (2012) 
 
Furin
Name:Furin
Type:Enzyme Catalytic Domain
Mol. Mass.:86676.01
Organism:Homo sapiens (Human)
Description:P09958
Residue:794
BDBM50399751
NameBDBM50399751
Synonyms:CHEMBL2179431
TypeSmall organic molecule
Emp. Form.C40H80N18O8
Mol. Mass.941.179
SMILES[#6]-[#6](-[#6])-[#6@H](-[#7])-[#6](=O)-[#7]-[#6@@H](-[#6]-[#6]-[#6]-[#6]-[#7])-[#6](=O)-[#7]-[#6@@H](-[#6]-[#6]-[#6]\[#7]=[#6](/[#7])-[#7])-[#6](=O)-[#7]-[#6@@H](-[#6]-[#6]-[#6]\[#7]=[#6](/[#7])-[#7])-[#6](=O)-[#7]-[#6@@H](-[#6](-[#6])-[#6])-[#6](=O)-[#7]-[#6@@H](-[#6]-[#6]-[#6]-[#6]-[#7])-[#6](=O)-[#7]-[#6@@H](-[#6]-[#6]-[#6]\[#7]=[#6](/[#7])-[#7])-[#6](-[#8])=O