Reaction Details
TargetFurin
LigandBDBM50399754
Substrate/Competitorn/a
Meas. Tech.ChEMBL_877187 (CHEMBL2187695)
pH7.5±n/a
Ki 1.4±n/a nM
Commentsextracted
Citation Levesque, CFugère, MKwiatkowska, ACouture, FDesjardins, RRouthier, SMoussette, PPrahl, ALammek, BAppel, JRHoughten, RAD'Anjou, FDory, YLNeugebauer, WDay, R The Multi-Leu peptide inhibitor discriminates between PACE4 and furin and exhibits antiproliferative effects on prostate cancer cells. J Med Chem55:10501-11 (2012) 
 
Furin
Name:Furin
Type:Enzyme Catalytic Domain
Mol. Mass.:86676.01
Organism:Homo sapiens (Human)
Description:P09958
Residue:794
BDBM50399754
NameBDBM50399754
Synonyms:CHEMBL2179836
TypeSmall organic molecule
Emp. Form.C37H69N15O13
Mol. Mass.932.0365
SMILES[#7]-[#6]-[#6]-[#6]-[#6]-[#6@H](-[#7]-[#6](=O)-[#6@@H](-[#7])-[#6]-[#6]-[#6](-[#8])=O)-[#6](=O)-[#7]-[#6@@H](-[#6]-[#6]-[#6](-[#8])=O)-[#6](=O)-[#7]-[#6@@H](-[#6]-[#6]-[#6]\[#7]=[#6](/[#7])-[#7])-[#6](=O)-[#7]-[#6@@H](-[#6]-[#8])-[#6](=O)-[#7]-[#6@@H](-[#6]-[#6]-[#6]-[#6]-[#7])-[#6](=O)-[#7]-[#6@@H](-[#6]-[#6]-[#6]\[#7]=[#6](/[#7])-[#7])-[#6](-[#8])=O