Reaction Details
TargetProprotein convertase subtilisin/kexin type 6
LigandBDBM50399749
Substrate/Competitorn/a
Meas. Tech.ChEMBL_877191 (CHEMBL2187699)
pH6.5±n/a
Ki 0.34±n/a nM
Commentsextracted
Citation Levesque, CFugère, MKwiatkowska, ACouture, FDesjardins, RRouthier, SMoussette, PPrahl, ALammek, BAppel, JRHoughten, RAD'Anjou, FDory, YLNeugebauer, WDay, R The Multi-Leu peptide inhibitor discriminates between PACE4 and furin and exhibits antiproliferative effects on prostate cancer cells. J Med Chem55:10501-11 (2012) 
 
Proprotein convertase subtilisin/kexin type 6
Name:Proprotein convertase subtilisin/kexin type 6
Type:PROTEIN
Mol. Mass.:106442.22
Organism:Homo sapiens (Human)
Description:ChEMBL_1290742
Residue:969
BDBM50399749
NameBDBM50399749
Synonyms:CHEMBL2179430
TypeSmall organic molecule
Emp. Form.C39H77N17O8
Mol. Mass.912.1378
SMILES[#6]-[#6](-[#6])-[#6]-[#6@H](-[#7])-[#6](=O)-[#7]-[#6@@H](-[#6]-[#6](-[#6])-[#6])-[#6](=O)-[#7]-[#6@@H](-[#6]-[#6]-[#6]\[#7]=[#6](/[#7])-[#7])-[#6](=O)-[#7]-[#6@@H](-[#6]-[#6]-[#6]\[#7]=[#6](/[#7])-[#7])-[#6](=O)-[#7]-[#6@@H](-[#6])-[#6](=O)-[#7]-[#6@@H](-[#6]-[#6]-[#6]-[#6]-[#7])-[#6](=O)-[#7]-[#6@@H](-[#6]-[#6]-[#6]\[#7]=[#6](/[#7])-[#7])-[#6](-[#8])=O