Reaction Details
TargetC-X-C chemokine receptor type 3
LigandBDBM50399980
Substrate/Competitorn/a
Meas. Tech.ChEMBL_877964 (CHEMBL2189030)
Ki 39.81±n/a nM
Citation Wijtmans, MScholten, DJRoumen, LCanals, MCusters, HGlas, MVreeker, MCde Kanter, FJde Graaf, CSmit, MJde Esch, IJLeurs, R Chemical subtleties in small-molecule modulation of peptide receptor function: the case of CXCR3 biaryl-type ligands. J Med Chem55:10572-83 (2012) 
 
C-X-C chemokine receptor type 3
Name:C-X-C chemokine receptor type 3
Type:Enzyme Catalytic Domain
Mol. Mass.:40665.65
Organism:Homo sapiens (Human)
Description:n/a
Residue:368
BDBM50399980
NameBDBM50399980
Synonyms:CHEMBL2181467
TypeSmall organic molecule
Emp. Form.C40H44N4O4
Mol. Mass.644.8018
SMILESNCCCC[C@H](NC(=O)[C@@H]1Cc2ccccc2CN1C(=O)CCC(=O)c1ccccc1)C(=O)NCC(c1ccccc1)c1ccccc1