Reaction Details
TargetC-X-C chemokine receptor type 3
LigandBDBM50399982
Substrate/Competitorn/a
Meas. Tech.ChEMBL_877964 (CHEMBL2189030)
Ki 63.1±n/a nM
Citation Wijtmans, MScholten, DJRoumen, LCanals, MCusters, HGlas, MVreeker, MCde Kanter, FJde Graaf, CSmit, MJde Esch, IJLeurs, R Chemical subtleties in small-molecule modulation of peptide receptor function: the case of CXCR3 biaryl-type ligands. J Med Chem55:10572-83 (2012) 
 
C-X-C chemokine receptor type 3
Name:C-X-C chemokine receptor type 3
Type:Enzyme Catalytic Domain
Mol. Mass.:40665.65
Organism:Homo sapiens (Human)
Description:n/a
Residue:368
BDBM50399982
NameBDBM50399982
Synonyms:CHEMBL2181443
TypeSmall organic molecule
Emp. Form.C25H31IN
Mol. Mass.472.4243
SMILESCC1(C)[C@@H]2C[C@H]1C(C[N+](C)(C)Cc1ccc(cc1)-c1ccccc1I)=CC2