Reaction Details
TargetC-X-C chemokine receptor type 3
LigandBDBM50399987
Substrate/Competitorn/a
Meas. Tech.ChEMBL_877964 (CHEMBL2189030)
Ki 158.49±n/a nM
Citation Wijtmans, MScholten, DJRoumen, LCanals, MCusters, HGlas, MVreeker, MCde Kanter, FJde Graaf, CSmit, MJde Esch, IJLeurs, R Chemical subtleties in small-molecule modulation of peptide receptor function: the case of CXCR3 biaryl-type ligands. J Med Chem55:10572-83 (2012) 
 
C-X-C chemokine receptor type 3
Name:C-X-C chemokine receptor type 3
Type:Enzyme Catalytic Domain
Mol. Mass.:40665.65
Organism:Homo sapiens (Human)
Description:n/a
Residue:368
BDBM50399987
NameBDBM50399987
Synonyms:CHEMBL2181464
TypeSmall organic molecule
Emp. Form.C26H34N
Mol. Mass.360.5543
SMILESCc1ccccc1-c1ccc(C[N+](C)(C)CC2=CC[C@H]3C[C@@H]2C3(C)C)cc1