Reaction Details
TargetC-X-C chemokine receptor type 3
LigandBDBM50399991
Substrate/Competitorn/a
Meas. Tech.ChEMBL_877964 (CHEMBL2189030)
Ki 200±n/a nM
Citation Wijtmans, MScholten, DJRoumen, LCanals, MCusters, HGlas, MVreeker, MCde Kanter, FJde Graaf, CSmit, MJde Esch, IJLeurs, R Chemical subtleties in small-molecule modulation of peptide receptor function: the case of CXCR3 biaryl-type ligands. J Med Chem55:10572-83 (2012) 
 
C-X-C chemokine receptor type 3
Name:C-X-C chemokine receptor type 3
Type:Enzyme Catalytic Domain
Mol. Mass.:40665.65
Organism:Homo sapiens (Human)
Description:n/a
Residue:368
BDBM50399991
NameBDBM50399991
Synonyms:CHEMBL2181454
TypeSmall organic molecule
Emp. Form.C19H27ClN
Mol. Mass.304.877
SMILESCC1(C)[C@@H]2C[C@H]1C(C[N+](C)(C)Cc1ccc(Cl)cc1)=CC2