Reaction Details
TargetTyrosine-protein kinase SYK
LigandBDBM50400035
Substrate/Competitorn/a
Meas. Tech.ChEMBL_877991 (CHEMBL2189057)
IC50 16±n/a nM
Citation Lucas, MCGoldstein, DMHermann, JCKuglstatter, ALiu, WLuk, KCPadilla, FSlade, MVillaseñor, AGWanner, JXie, WZhang, XLiao, C Rational design of highly selective spleen tyrosine kinase inhibitors. J Med Chem55:10414-23 (2012) 
 
Tyrosine-protein kinase SYK
Name:Tyrosine-protein kinase SYK
Type:Enzyme
Mol. Mass.:72079.99
Organism:Homo sapiens (Human)
Description:P43405
Residue:635
BDBM50400035
NameBDBM50400035
Synonyms:CHEMBL2177735 | US9169259, I-84
TypeSmall organic molecule
Emp. Form.C23H25N7
Mol. Mass.399.4915
SMILESCC1CCCN1c1cccc(Nc2cc(nn3ccnc23)-c2cccc(CN)c2)n1