Reaction Details
TargetTyrosine-protein kinase SYK
LigandBDBM50400037
Substrate/Competitorn/a
Meas. Tech.ChEMBL_877991 (CHEMBL2189057)
IC50 127±n/a nM
Citation Lucas, MCGoldstein, DMHermann, JCKuglstatter, ALiu, WLuk, KCPadilla, FSlade, MVillaseñor, AGWanner, JXie, WZhang, XLiao, C Rational design of highly selective spleen tyrosine kinase inhibitors. J Med Chem55:10414-23 (2012) 
 
Tyrosine-protein kinase SYK
Name:Tyrosine-protein kinase SYK
Type:Enzyme
Mol. Mass.:72079.99
Organism:Homo sapiens (Human)
Description:P43405
Residue:635
BDBM50400037
NameBDBM50400037
Synonyms:CHEMBL2177733 | US9169259, I-5
TypeSmall organic molecule
Emp. Form.C22H22N6
Mol. Mass.370.4503
SMILESCC1CCCN1c1cccc(Nc2cc(nn3ccnc23)-c2ccccc2)n1