Reaction Details
TargetTyrosine-protein kinase SYK
LigandBDBM50400042
Substrate/Competitorn/a
Meas. Tech.ChEMBL_877991 (CHEMBL2189057)
IC50 93±n/a nM
Citation Lucas, MCGoldstein, DMHermann, JCKuglstatter, ALiu, WLuk, KCPadilla, FSlade, MVillaseñor, AGWanner, JXie, WZhang, XLiao, C Rational design of highly selective spleen tyrosine kinase inhibitors. J Med Chem55:10414-23 (2012) 
 
Tyrosine-protein kinase SYK
Name:Tyrosine-protein kinase SYK
Type:Enzyme
Mol. Mass.:72079.99
Organism:Homo sapiens (Human)
Description:P43405
Residue:635
BDBM50400042
NameBDBM50400042
Synonyms:CHEMBL2177728
TypeSmall organic molecule
Emp. Form.C25H24N6O5S
Mol. Mass.520.56
SMILESCOc1ccc(Nc2nc(nc3scnc23)N2CCC(C2)C(=O)Nc2ccc(cc2)C(O)=O)cc1OC