Reaction Details
Target11-beta-hydroxysteroid dehydrogenase 1
LigandBDBM50400152
Substrate/Competitorn/a
Meas. Tech.ChEMBL_878465 (CHEMBL2187379)
IC50 20±n/a nM
Citation Goldberg, FWLeach, AGScott, JSSnelson, WLGroombridge, SDDonald, CSBennett, SNBodin, CGutierrez, PMGyte, AC Free-Wilson and structural approaches to co-optimizing human and rodent isoform potency for 11ß-hydroxysteroid dehydrogenase type 1 (11ß-HSD1) inhibitors. J Med Chem55:10652-61 (2012) 
 
11-beta-hydroxysteroid dehydrogenase 1
Name:11-beta-hydroxysteroid dehydrogenase 1
Type:Enzyme
Mol. Mass.:32369.70
Organism:Mus musculus (mouse)
Description:P50172
Residue:292
BDBM50400152
NameBDBM50400152
Synonyms:CHEMBL2179013
TypeSmall organic molecule
Emp. Form.C23H34N4O4
Mol. Mass.430.5405
SMILESCC(C)(CO)Nc1ncc(C(=O)N[C@H]2C3CC4CC2C[C@](O)(C4)C3)c(OC2CCC2)n1