Reaction Details
Target11-beta-hydroxysteroid dehydrogenase 1
LigandBDBM50400168
Substrate/Competitorn/a
Meas. Tech.ChEMBL_878465 (CHEMBL2187379)
IC50 179±n/a nM
Citation Goldberg, FWLeach, AGScott, JSSnelson, WLGroombridge, SDDonald, CSBennett, SNBodin, CGutierrez, PMGyte, AC Free-Wilson and structural approaches to co-optimizing human and rodent isoform potency for 11ß-hydroxysteroid dehydrogenase type 1 (11ß-HSD1) inhibitors. J Med Chem55:10652-61 (2012) 
 
11-beta-hydroxysteroid dehydrogenase 1
Name:11-beta-hydroxysteroid dehydrogenase 1
Type:Enzyme
Mol. Mass.:32369.70
Organism:Mus musculus (mouse)
Description:P50172
Residue:292
BDBM50400168
NameBDBM50400168
Synonyms:CHEMBL2179025
TypeSmall organic molecule
Emp. Form.C22H32N4O3
Mol. Mass.400.5145
SMILESOCCNc1ncc(C(=O)N[C@H]2C3CC4CC2C[C@](O)(C4)C3)c(n1)C1CCCC1