Reaction Details
Target11-beta-hydroxysteroid dehydrogenase 1
LigandBDBM50400167
Substrate/Competitorn/a
Meas. Tech.ChEMBL_878466 (CHEMBL2187380)
IC50 15±n/a nM
Citation Goldberg, FWLeach, AGScott, JSSnelson, WLGroombridge, SDDonald, CSBennett, SNBodin, CGutierrez, PMGyte, AC Free-Wilson and structural approaches to co-optimizing human and rodent isoform potency for 11ß-hydroxysteroid dehydrogenase type 1 (11ß-HSD1) inhibitors. J Med Chem55:10652-61 (2012) 
 
11-beta-hydroxysteroid dehydrogenase 1
Name:11-beta-hydroxysteroid dehydrogenase 1
Type:Enzyme
Mol. Mass.:32409.16
Organism:Homo sapiens (Human)
Description:P28845
Residue:292
BDBM50400167
NameBDBM50400167
Synonyms:CHEMBL2179026
TypeSmall organic molecule
Emp. Form.C23H34N4O3
Mol. Mass.414.5411
SMILESCOCCNc1ncc(C(=O)N[C@H]2C3CC4CC2C[C@](O)(C4)C3)c(n1)C1CCCC1