Reaction Details
TargetCasein kinase I isoform alpha
LigandBDBM50400751
Substrate/Competitorn/a
Meas. Tech.ChEMBL_880534 (CHEMBL2211469)
IC50 33±n/a nM
Citation Huang, HAcquaviva, LBerry, VBregman, HChakka, NDiMauro, EFDovey, JEpstein, OGrubinska, BGoldstein, JGunaydin, HHua, ZHuang, XHuang, LHuman, JLong, ANewcomb, JPatel, VFSaffran, DSerafino, RSchneider, SStrathdee, CTang, JTurci, SWhite, RYu, VZhao, HWilson, CMartin, MW Structure-Based Design of Potent and Selective CK1¿ Inhibitors. ACS Med Chem Lett3:1059-1064 (2012) 
 
Casein kinase I isoform alpha
Name:Casein kinase I isoform alpha
Type:Serine/threonine-protein kinase
Mol. Mass.:38936.59
Organism:Homo sapiens (Human)
Description:P48729
Residue:337
BDBM50400751
NameBDBM50400751
Synonyms:CHEMBL2203553
TypeSmall organic molecule
Emp. Form.C20H17FN4O2
Mol. Mass.364.373
SMILESCOc1cnc(\C=C\c2ccc(F)cc2)nc1-c1cc2c(CCNC2=O)[nH]1