Reaction Details
TargetCasein kinase I isoform alpha
LigandBDBM50400754
Substrate/Competitorn/a
Meas. Tech.ChEMBL_880534 (CHEMBL2211469)
IC50 442±n/a nM
Citation Huang, HAcquaviva, LBerry, VBregman, HChakka, NDiMauro, EFDovey, JEpstein, OGrubinska, BGoldstein, JGunaydin, HHua, ZHuang, XHuang, LHuman, JLong, ANewcomb, JPatel, VFSaffran, DSerafino, RSchneider, SStrathdee, CTang, JTurci, SWhite, RYu, VZhao, HWilson, CMartin, MW Structure-Based Design of Potent and Selective CK1¿ Inhibitors. ACS Med Chem Lett3:1059-1064 (2012) 
 
Casein kinase I isoform alpha
Name:Casein kinase I isoform alpha
Type:Serine/threonine-protein kinase
Mol. Mass.:38936.59
Organism:Homo sapiens (Human)
Description:P48729
Residue:337
BDBM50400754
NameBDBM50400754
Synonyms:CHEMBL2203564
TypeSmall organic molecule
Emp. Form.C21H20FN3O3
Mol. Mass.381.4002
SMILESCOc1cnc(COc2ccc(F)cc2C)cc1-c1cc2c(CCNC2=O)[nH]1