Reaction Details
TargetC-X-C chemokine receptor type 3
LigandBDBM50400970
Substrate/Competitorn/a
Meas. Tech.ChEMBL_880272 (CHEMBL2215850)
Ki 630.96±n/a nM
Citation Wijtmans, MVerzijl, DBergmans, SLai, MBosch, LSmit, MJde Esch, IJLeurs, R CXCR3 antagonists: quaternary ammonium salts equipped with biphenyl- and polycycloaliphatic-anchors. Bioorg Med Chem19:3384-93 (2011) 
 
C-X-C chemokine receptor type 3
Name:C-X-C chemokine receptor type 3
Type:Enzyme Catalytic Domain
Mol. Mass.:40665.65
Organism:Homo sapiens (Human)
Description:n/a
Residue:368
BDBM50400970
NameBDBM50400970
Synonyms:CHEMBL2205705
TypeSmall organic molecule
Emp. Form.C20H29IN
Mol. Mass.410.3549
SMILESCC[N+](C)(CC1=CC[C@H]2C[C@@H]1C2(C)C)Cc1ccc(I)cc1