Reaction Details
TargetCholinesterase
LigandBDBM50396135
Substrate/Competitorn/a
Meas. Tech.ChEMBL_883946 (CHEMBL2214109)
IC50 2.04±n/a nM
Citation Chen, XZenger, KLupp, AKling, BHeilmann, JFleck, CKraus, BDecker, M Tacrine-silibinin codrug shows neuro- and hepatoprotective effects in vitro and pro-cognitive and hepatoprotective effects in vivo. J Med Chem55:5231-42 (2012) 
 
Cholinesterase
Name:Cholinesterase
Type:Enzyme
Mol. Mass.:65643.35
Organism:Equus caballus (Horse)
Description:P81908
Residue:574
BDBM50396135
NameBDBM50396135
Synonyms:CHEMBL2171328
TypeSmall organic molecule
Emp. Form.C19H27N3
Mol. Mass.297.4378
SMILESNCCCCCCNc1c2CCCCc2nc2ccccc12