Reaction Details
TargetCholinesterase
LigandBDBM50401096
Substrate/Competitorn/a
Meas. Tech.ChEMBL_883946 (CHEMBL2214109)
IC50 361.3±n/a nM
Citation Chen, XZenger, KLupp, AKling, BHeilmann, JFleck, CKraus, BDecker, M Tacrine-silibinin codrug shows neuro- and hepatoprotective effects in vitro and pro-cognitive and hepatoprotective effects in vivo. J Med Chem55:5231-42 (2012) 
 
Cholinesterase
Name:Cholinesterase
Type:Enzyme
Mol. Mass.:65643.35
Organism:Equus caballus (Horse)
Description:P81908
Residue:574
BDBM50401096
NameBDBM50401096
Synonyms:CHEMBL2204448
TypeSmall organic molecule
Emp. Form.C23H31N3O3
Mol. Mass.397.5105
SMILESOC(=O)CCC(=O)NCCCCCCNc1c2CCCCc2nc2ccccc12