Reaction Details
TargetAurora kinase A
LigandBDBM50401433
Substrate/Competitorn/a
Meas. Tech.ChEMBL_883357 (CHEMBL2214093)
IC50 41±n/a nM
Citation Bavetsias, VCrumpler, SSun, CAvery, SAtrash, BFaisal, AMoore, ASKosmopoulou, MBrown, NSheldrake, PWBush, KHenley, ABox, GValenti, Mde Haven Brandon, ARaynaud, FIWorkman, PEccles, SABayliss, RLinardopoulos, SBlagg, J Optimization of imidazo[4,5-b]pyridine-based kinase inhibitors: identification of a dual FLT3/Aurora kinase inhibitor as an orally bioavailable preclinical development candidate for the treatment of acute myeloid leukemia. J Med Chem55:8721-34 (2012) 
 
Aurora kinase A
Name:Aurora kinase A
Type:Serine/threonine-protein kinase
Mol. Mass.:45830.98
Organism:Homo sapiens (Human)
Description:O14965
Residue:403
BDBM50401433
NameBDBM50401433
Synonyms:CHEMBL2207515
TypeSmall organic molecule
Emp. Form.C20H23ClN8O
Mol. Mass.426.903
SMILESCCn1cc(cn1)-c1nc2ncc(Cl)c(N3CCN(Cc4cc(C)on4)CC3)c2[nH]1