Reaction Details
TargetAurora kinase A
LigandBDBM50401421
Substrate/Competitorn/a
Meas. Tech.ChEMBL_883357 (CHEMBL2214093)
IC50 38±n/a nM
Citation Bavetsias, VCrumpler, SSun, CAvery, SAtrash, BFaisal, AMoore, ASKosmopoulou, MBrown, NSheldrake, PWBush, KHenley, ABox, GValenti, Mde Haven Brandon, ARaynaud, FIWorkman, PEccles, SABayliss, RLinardopoulos, SBlagg, J Optimization of imidazo[4,5-b]pyridine-based kinase inhibitors: identification of a dual FLT3/Aurora kinase inhibitor as an orally bioavailable preclinical development candidate for the treatment of acute myeloid leukemia. J Med Chem55:8721-34 (2012) 
 
Aurora kinase A
Name:Aurora kinase A
Type:Serine/threonine-protein kinase
Mol. Mass.:45830.98
Organism:Homo sapiens (Human)
Description:O14965
Residue:403
BDBM50401421
NameBDBM50401421
Synonyms:CHEMBL2207503
TypeSmall organic molecule
Emp. Form.C22H23Cl2N7
Mol. Mass.456.371
SMILESCc1nn(C)cc1-c1nc2ncc(Cl)c(N3CCN(Cc4ccc(Cl)cc4)CC3)c2[nH]1