Reaction Details
TargetReceptor-type tyrosine-protein kinase FLT3
LigandBDBM50401432
Substrate/Competitorn/a
Meas. Tech.ChEMBL_883356 (CHEMBL2214092)
Kd 12±n/a nM
Citation Bavetsias, VCrumpler, SSun, CAvery, SAtrash, BFaisal, AMoore, ASKosmopoulou, MBrown, NSheldrake, PWBush, KHenley, ABox, GValenti, Mde Haven Brandon, ARaynaud, FIWorkman, PEccles, SABayliss, RLinardopoulos, SBlagg, J Optimization of imidazo[4,5-b]pyridine-based kinase inhibitors: identification of a dual FLT3/Aurora kinase inhibitor as an orally bioavailable preclinical development candidate for the treatment of acute myeloid leukemia. J Med Chem55:8721-34 (2012) 
 
Receptor-type tyrosine-protein kinase FLT3
Name:Receptor-type tyrosine-protein kinase FLT3
Type:Enzyme
Mol. Mass.:112888.62
Organism:Homo sapiens (Human)
Description:P36888
Residue:993
BDBM50401432
NameBDBM50401432
Synonyms:CHEMBL2207514
TypeSmall organic molecule
Emp. Form.C19H21ClN8O
Mol. Mass.412.876
SMILESCc1cc(CN2CCN(CC2)c2c(Cl)cnc3nc([nH]c23)-c2cnn(C)c2)no1