Reaction Details
TargetCathepsin S
LigandBDBM50401809
Substrate/Competitorn/a
Meas. Tech.ChEMBL_885155 (CHEMBL2213246)
IC50 28±n/a nM
Citation Moss, NXiong, ZBurke, MCogan, DGao, DAHaverty, KHeim-Riether, AHickey, ERNagaraja, RNetherton, MO'Shea, KRamsden, PSchwartz, RShih, DTWard, YYoung, EZhang, Q Exploration of cathepsin S inhibitors characterized by a triazole P1-P2 amide replacement. Bioorg Med Chem Lett22:7189-93 (2012) 
 
Cathepsin S
Name:Cathepsin S
Type:Protein
Mol. Mass.:37507.38
Organism:Homo sapiens (Human)
Description:P25774
Residue:331
BDBM50401809
NameBDBM50401809
Synonyms:CHEMBL2207152
TypeSmall organic molecule
Emp. Form.C19H25N5S
Mol. Mass.355.5
SMILESC[C@](NCc1ccsc1)(C1CCCCC1)c1cn(nn1)C1(CC1)C#N