Reaction Details
TargetCathepsin S
LigandBDBM50401765
Substrate/Competitorn/a
Meas. Tech.ChEMBL_885153 (CHEMBL2213244)
IC50 13±n/a nM
Citation Moss, NXiong, ZBurke, MCogan, DGao, DAHaverty, KHeim-Riether, AHickey, ERNagaraja, RNetherton, MO'Shea, KRamsden, PSchwartz, RShih, DTWard, YYoung, EZhang, Q Exploration of cathepsin S inhibitors characterized by a triazole P1-P2 amide replacement. Bioorg Med Chem Lett22:7189-93 (2012) 
 
Cathepsin S
Name:Cathepsin S
Type:Protein
Mol. Mass.:37507.38
Organism:Homo sapiens (Human)
Description:P25774
Residue:331
BDBM50401765
NameBDBM50401765
Synonyms:CHEMBL2207563
TypeSmall organic molecule
Emp. Form.C19H25N5OS
Mol. Mass.371.5
SMILESC[C@@H](C#N)n1cc(nn1)[C@@](C)(NC(=O)c1ccsc1)[C@H]1CC[C@H](C)CC1