Reaction Details
TargetPancreatic alpha-amylase
LigandBDBM50333465
Substrate/Competitorn/a
Meas. Tech.ChEMBL_886576 (CHEMBL2215736)
IC50 35500±n/a nM
Citation Patil, VSNandre, KPGhosh, SRao, VJChopade, BABhosale, SVBhosale, SV Synthesis and glycosidase inhibitory activity of novel (2-phenyl-4H-benzopyrimedo[2,1-b]-thiazol-4-yliden)acetonitrile derivatives. Bioorg Med Chem Lett22:7011-4 (2012) 
 
Pancreatic alpha-amylase
Name:Pancreatic alpha-amylase
Type:Protein
Mol. Mass.:57088.07
Organism:Sus scrofa (Pig)
Description:P00690
Residue:511
BDBM50333465
NameBDBM50333465
Synonyms:(2R,3R,4R,5R,6R)-5-((2R,3R,4R,5S,6R)-5-((2R,3R,4S,5S,6R)-3,4-dihydroxy-6-methyl-5-((1S,4R,5S,6S)-4,5,6-trihydroxy-3-(hydroxymethyl)cyclohex-2-enylamino)-tetrahydro-2H-pyran-2-yloxy)-3,4-dihydroxy-6-(hydroxymethyl)-tetrahydro-2H-pyran-2-yloxy)-6-(hydroxymethyl)-tetrahydro-2H-pyran-2,3,4-triol (2R,3R,4R,5S,6R)-5-((2R,3R,4R,5S,6R)-5-((2R,3R,4S,5S,6R)-3,4-dihydroxy-6-methyl-5-((1S,4S,5S,6S)-4,5,6-trihydroxy-3-(hydroxymethyl)cyclohex-2-enylamino)-tetrahydro-2H-pyran-2-yloxy)-3,4-dihydroxy-6-(hydroxymethyl)-tetrahydro-2H-pyran-2-yloxy)-6-(hydroxymethyl)-tetrahydro-2H-pyran-2,3,4-triol 5-{5-[3,4-Dihydroxy-6-methyl-5-(4,5,6-trihydroxy-3-hydroxymethyl-cyclohex-2-enylamino)-tetrahydro-pyran-2-yloxy]-3,4-dihydroxy-6-hydroxymethyl-tetrahydro-pyran-2-yloxy}-6-hydroxymethyl-tetrahydro-pyran-2,3,4-triol CHEMBL1566 Precose | acarbose
TypeSmall organic molecule
Emp. Form.C25H43NO18
Mol. Mass.645.6048
SMILESC[C@H]1O[C@H](O[C@@H]2[C@@H](CO)O[C@H](O[C@@H]3[C@@H](CO)O[C@@H](O)[C@H](O)[C@H]3O)[C@H](O)[C@H]2O)[C@H](O)[C@@H](O)[C@@H]1N[C@H]1C=C(CO)[C@@H](O)[C@H](O)[C@H]1O