Reaction Details
TargetPyruvate kinase
LigandBDBM50402620
Substrate/Competitorn/a
Meas. Tech.ChEMBL_886791 (CHEMBL2210482)
IC50 1312±n/a nM
Citation Kumar, NSAmandoron, EACherkasov, AFinlay, BBGong, HJackson, LKaur, SLian, TMoreau, ALabrière, CReiner, NESee, RHStrynadka, NCThorson, LWong, EWWorrall, LZoraghi, RYoung, RN Optimization and structure-activity relationships of a series of potent inhibitors of methicillin-resistant Staphylococcus aureus (MRSA) pyruvate kinase as novel antimicrobial agents. Bioorg Med Chem20:7069-82 (2012) 
 
Pyruvate kinase
Name:Pyruvate kinase
Type:PROTEIN
Mol. Mass.:63128.44
Organism:Staphylococcus aureus (strain MRSA252)
Description:ChEMBL_1434805
Residue:585
BDBM50402620
NameBDBM50402620
Synonyms:CHEMBL2206168
TypeSmall organic molecule
Emp. Form.C17H14BrN3O2
Mol. Mass.372.216
SMILESCC(=NNC(=O)c1ccc(Br)cc1O)c1cc2ccccc2[nH]1