Reaction Details
TargetSphingosine 1-phosphate receptor 1
LigandBDBM50402742
Substrate/Competitorn/a
Meas. Tech.ChEMBL_886921 (CHEMBL2211877)
EC50>10000±n/a nM
Citation Aguilar, NMir, MGrima, PMLópez, MSegarra, VEsteban, LMoreno, IGodessart, NTarrasón, GDomenech, TVilella, DArmengol, CCórdoba, MSabaté, MCasals, DDomínguez, M Discovery of a novel class of zwitterionic, potent, selective and orally active S1P1 direct agonists. Bioorg Med Chem Lett22:7672-6 (2012) 
 
Sphingosine 1-phosphate receptor 1
Name:Sphingosine 1-phosphate receptor 1
Type:Enzyme
Mol. Mass.:42836.02
Organism:Homo sapiens (Human)
Description:P21453
Residue:382
BDBM50402742
NameBDBM50402742
Synonyms:CHEMBL2207773
TypeSmall organic molecule
Emp. Form.C23H25N3O4S
Mol. Mass.439.527
SMILESCCCCN(C(=O)c1cccc(OC)c1)c1nnc(s1)-c1ccc(CCC(O)=O)cc1