Reaction Details
TargetSphingosine 1-phosphate receptor 1
LigandBDBM50402745
Substrate/Competitorn/a
Meas. Tech.ChEMBL_886921 (CHEMBL2211877)
EC50 9000±n/a nM
Citation Aguilar, NMir, MGrima, PMLópez, MSegarra, VEsteban, LMoreno, IGodessart, NTarrasón, GDomenech, TVilella, DArmengol, CCórdoba, MSabaté, MCasals, DDomínguez, M Discovery of a novel class of zwitterionic, potent, selective and orally active S1P1 direct agonists. Bioorg Med Chem Lett22:7672-6 (2012) 
 
Sphingosine 1-phosphate receptor 1
Name:Sphingosine 1-phosphate receptor 1
Type:Enzyme
Mol. Mass.:42836.02
Organism:Homo sapiens (Human)
Description:P21453
Residue:382
BDBM50402745
NameBDBM50402745
Synonyms:CHEMBL2207770
TypeSmall organic molecule
Emp. Form.C20H20FN3O4S
Mol. Mass.417.454
SMILESCOCCN(C(=O)c1cccc(F)c1)c1nnc(s1)-c1ccc(OC)c(OC)c1