Reaction Details
TargetSphingosine 1-phosphate receptor 1
LigandBDBM50402747
Substrate/Competitorn/a
Meas. Tech.ChEMBL_886921 (CHEMBL2211877)
EC50 0.5±n/a nM
Citation Aguilar, NMir, MGrima, PMLópez, MSegarra, VEsteban, LMoreno, IGodessart, NTarrasón, GDomenech, TVilella, DArmengol, CCórdoba, MSabaté, MCasals, DDomínguez, M Discovery of a novel class of zwitterionic, potent, selective and orally active S1P1 direct agonists. Bioorg Med Chem Lett22:7672-6 (2012) 
 
Sphingosine 1-phosphate receptor 1
Name:Sphingosine 1-phosphate receptor 1
Type:Enzyme
Mol. Mass.:42836.02
Organism:Homo sapiens (Human)
Description:P21453
Residue:382
BDBM50402747
NameBDBM50402747
Synonyms:CHEMBL2207793
TypeSmall organic molecule
Emp. Form.C26H29ClN4O3S
Mol. Mass.513.051
SMILESCCCCN(C(=O)c1ccccc1Cl)c1nnc(s1)-c1cc(C)c(CN2CC(C2)C(O)=O)c(C)c1