Reaction Details
TargetSphingosine 1-phosphate receptor 3
LigandBDBM50402731
Substrate/Competitorn/a
Meas. Tech.ChEMBL_886917 (CHEMBL2211873)
EC50>2000±n/a nM
Citation Aguilar, NMir, MGrima, PMLópez, MSegarra, VEsteban, LMoreno, IGodessart, NTarrasón, GDomenech, TVilella, DArmengol, CCórdoba, MSabaté, MCasals, DDomínguez, M Discovery of a novel class of zwitterionic, potent, selective and orally active S1P1 direct agonists. Bioorg Med Chem Lett22:7672-6 (2012) 
 
Sphingosine 1-phosphate receptor 3
Name:Sphingosine 1-phosphate receptor 3
Type:G Protein-Coupled Receptor (GPCR)
Mol. Mass.:42278.13
Organism:Homo sapiens (Human)
Description:Q99500
Residue:378
BDBM50402731
NameBDBM50402731
Synonyms:CHEMBL2207784
TypeSmall organic molecule
Emp. Form.C24H23FN4O3S
Mol. Mass.466.528
SMILESOC(=O)C1CN(Cc2ccc(cc2)-c2nnc(s2)N(CC2CC2)C(=O)c2ccccc2F)C1