Reaction Details
TargetSphingosine 1-phosphate receptor 5
LigandBDBM50402737
Substrate/Competitorn/a
Meas. Tech.ChEMBL_886914 (CHEMBL2211870)
EC50 62±n/a nM
Citation Aguilar, NMir, MGrima, PMLópez, MSegarra, VEsteban, LMoreno, IGodessart, NTarrasón, GDomenech, TVilella, DArmengol, CCórdoba, MSabaté, MCasals, DDomínguez, M Discovery of a novel class of zwitterionic, potent, selective and orally active S1P1 direct agonists. Bioorg Med Chem Lett22:7672-6 (2012) 
 
Sphingosine 1-phosphate receptor 5
Name:Sphingosine 1-phosphate receptor 5
Type:G Protein-Coupled Receptor (GPCR)
Mol. Mass.:41796.42
Organism:Homo sapiens (Human)
Description:n/a
Residue:398
BDBM50402737
NameBDBM50402737
Synonyms:CHEMBL2207778
TypeSmall organic molecule
Emp. Form.C24H25FN4O3S
Mol. Mass.468.544
SMILESCCCCN(C(=O)c1ccccc1F)c1nnc(s1)-c1ccc(CN2CC(C2)C(O)=O)cc1