Reaction Details
TargetMitogen-activated protein kinase 9
LigandBDBM50402845
Substrate/Competitorn/a
Meas. Tech.ChEMBL_884763 (CHEMBL2215644)
IC50 3800±n/a nM
Citation Gong, LTan, YCBoice, GAbbot, SMcCaleb, KIyer, PZuo, FDal Porto, JWong, BJin, SChang, ATran, PHsieh, GNiu, LShao, AReuter, DLukacs, CMUrsula Kammlott, RKuglstatter, AGoldstein, D Discovery of a novel series of 4-quinolone JNK inhibitors. Bioorg Med Chem Lett22:7381-7 (2012) 
 
Mitogen-activated protein kinase 9
Name:Mitogen-activated protein kinase 9
Type:Enzyme
Mol. Mass.:48131.49
Organism:Homo sapiens (Human)
Description:JNK-2 was purchased from Upstate Cell Signaling Solutions (formerly Upstate Biotechnology).
Residue:424
BDBM50402845
NameBDBM50402845
Synonyms:CHEMBL2204104
TypeSmall organic molecule
Emp. Form.C21H15ClN2O2
Mol. Mass.362.809
SMILESClc1ccc2c(c1)n(-c1ccccc1)c(=O)n(Cc1ccccc1)c2=O