Reaction Details
TargetMitogen-activated protein kinase 8
LigandBDBM50402835
Substrate/Competitorn/a
Meas. Tech.ChEMBL_884764 (CHEMBL2216094)
IC50 47±n/a nM
Citation Gong, LTan, YCBoice, GAbbot, SMcCaleb, KIyer, PZuo, FDal Porto, JWong, BJin, SChang, ATran, PHsieh, GNiu, LShao, AReuter, DLukacs, CMUrsula Kammlott, RKuglstatter, AGoldstein, D Discovery of a novel series of 4-quinolone JNK inhibitors. Bioorg Med Chem Lett22:7381-7 (2012) 
 
Mitogen-activated protein kinase 8
Name:Mitogen-activated protein kinase 8
Type:Enzyme
Mol. Mass.:48297.57
Organism:Homo sapiens (Human)
Description:JNK-1 was purchased from Upstate Cell Signaling Solutions (formerly Upstate Biotechnology).
Residue:427
BDBM50402835
NameBDBM50402835
Synonyms:CHEMBL2204106
TypeSmall organic molecule
Emp. Form.C25H21ClN2O5S
Mol. Mass.496.963
SMILESCNS(=O)(=O)c1ccc(Cc2c(C(=O)OC)n(-c3ccccc3)c3cc(Cl)ccc3c2=O)cc1