Reaction Details
TargetMitogen-activated protein kinase 15
LigandBDBM50392982
Substrate/Competitorn/a
Meas. Tech.ChEMBL_884740 (CHEMBL2215621)
Kd>10000±n/a nM
Citation Gong, LTan, YCBoice, GAbbot, SMcCaleb, KIyer, PZuo, FDal Porto, JWong, BJin, SChang, ATran, PHsieh, GNiu, LShao, AReuter, DLukacs, CMUrsula Kammlott, RKuglstatter, AGoldstein, D Discovery of a novel series of 4-quinolone JNK inhibitors. Bioorg Med Chem Lett22:7381-7 (2012) 
 
Mitogen-activated protein kinase 15
Name:Mitogen-activated protein kinase 15
Type:Serine/threonine-protein kinase
Mol. Mass.:59850.14
Organism:Homo sapiens (Human)
Description:gi_95147356
Residue:544
BDBM50392982
NameBDBM50392982
Synonyms:CHEMBL2152382
TypeSmall organic molecule
Emp. Form.C27H23ClN2O5
Mol. Mass.490.935
SMILESCOC(=O)c1c(Cc2ccc(cc2)C(=O)NCCO)c(=O)c2ccc(Cl)cc2n1-c1ccccc1