Reaction Details
TargetProthrombin
LigandBDBM50112086
Substrate/Competitorn/a
Meas. Tech.ChEMBL_887592 (CHEMBL2217201)
IC50 10±n/a nM
Citation Michaelis, SMarais, ASchrey, AKGraebner, OYSchaudt, CSefkow, MKroll, FDreger, MGlinski, MKoester, HMetternich, RFischer, JJ Dabigatran and dabigatran ethyl ester: potent inhibitors of ribosyldihydronicotinamide dehydrogenase (NQO2). J Med Chem55:3934-44 (2012) 
 
Prothrombin
Name:Prothrombin
Type:Protein
Mol. Mass.:70029.57
Organism:Homo sapiens (Human)
Description:P00734
Residue:622
BDBM50112086
NameBDBM50112086
Synonyms:3-({2-[(4-Carbamimidoyl-phenylamino)-methyl]-1-methyl-1H-benzoimidazole-5-carbonyl}-pyridin-2-yl-amino)-propionic acid DABIGATRAN
TypeSmall organic molecule
Emp. Form.C25H25N7O3
Mol. Mass.471.5111
SMILESCn1c(CNc2ccc(cc2)C(N)=N)nc2cc(ccc12)C(=O)N(CCC(O)=O)c1ccccn1