Reaction Details
TargetHistamine H3 receptor
LigandBDBM50222974
Substrate/Competitorn/a
Meas. Tech.ChEMBL_86932 (CHEMBL697541)
Ki 129±n/a nM
Citation Faghih, RDwight, WPan, JBFox, GBKrueger, KMEsbenshade, TAMcVey, JMMarsh, KBennani, YLHancock, AA Synthesis and SAR of aminoalkoxy-biaryl-4-carboxamides: novel and selective histamine H3 receptor antagonists. Bioorg Med Chem Lett13:1325-8 (2003) Histamine H3 receptor
Name:Histamine H3 receptor
Type:G Protein-Coupled Receptor (GPCR)
Mol. Mass.:48607.98
Organism:Rattus norvegicus (rat)
Description:n/a
Residue:445
BDBM50222974
NameBDBM50222974
Synonyms:CHEMBL24126
TypeSmall organic molecule
Emp. Form.C23H30N2O3
Mol. Mass.382.4959
SMILESCC(C)NCCCOc1ccc(cc1)-c1ccc(cc1)C(=O)N1CCOCC1