Reaction Details
TargetHistamine H3 receptor
LigandBDBM50217101
Substrate/Competitorn/a
Meas. Tech.ChEMBL_86932 (CHEMBL697541)
Ki 42±n/a nM
Citation Faghih, RDwight, WPan, JBFox, GBKrueger, KMEsbenshade, TAMcVey, JMMarsh, KBennani, YLHancock, AA Synthesis and SAR of aminoalkoxy-biaryl-4-carboxamides: novel and selective histamine H3 receptor antagonists. Bioorg Med Chem Lett13:1325-8 (2003) Histamine H3 receptor
Name:Histamine H3 receptor
Type:G Protein-Coupled Receptor (GPCR)
Mol. Mass.:48607.98
Organism:Rattus norvegicus (rat)
Description:n/a
Residue:445
BDBM50217101
NameBDBM50217101
Synonyms:CHEMBL25688
TypeSmall organic molecule
Emp. Form.C20H22N2O
Mol. Mass.306.4015
SMILESN#Cc1ccc(cc1)-c1ccc(OCCCN2CCCC2)cc1