Reaction Details
TargetHistamine H2 receptor
LigandBDBM50370569
Substrate/Competitorn/a
Meas. Tech.ChEMBL_85660 (CHEMBL877714)
Ki 10000±n/a nM
Citation Faghih, RDwight, WPan, JBFox, GBKrueger, KMEsbenshade, TAMcVey, JMMarsh, KBennani, YLHancock, AA Synthesis and SAR of aminoalkoxy-biaryl-4-carboxamides: novel and selective histamine H3 receptor antagonists. Bioorg Med Chem Lett13:1325-8 (2003) Histamine H2 receptor
Name:Histamine H2 receptor
Type:G Protein-Coupled Receptor (GPCR)
Mol. Mass.:40115.31
Organism:Homo sapiens (Human)
Description:n/a
Residue:359
BDBM50370569
NameBDBM50370569
Synonyms:A-349,821 | A-349821
TypeSmall organic molecule
Emp. Form.C26H34N2O3
Mol. Mass.422.5598
SMILESC[C@H]1CC[C@H](C)N1CCCOc1ccc(cc1)-c1ccc(cc1)C(=O)N1CCOCC1