Reaction Details
TargetHistamine H3 receptor
LigandBDBM50222966
Substrate/Competitorn/a
Meas. Tech.ChEMBL_83795 (CHEMBL692572)
Ki 23±n/a nM
Citation Faghih, RDwight, WPan, JBFox, GBKrueger, KMEsbenshade, TAMcVey, JMMarsh, KBennani, YLHancock, AA Synthesis and SAR of aminoalkoxy-biaryl-4-carboxamides: novel and selective histamine H3 receptor antagonists. Bioorg Med Chem Lett13:1325-8 (2003) Histamine H3 receptor
Name:Histamine H3 receptor
Type:G Protein-Coupled Receptor (GPCR)
Mol. Mass.:48691.47
Organism:Homo sapiens (Human)
Description:Binding assays were using CHO cells stably expressing hH3R receptors.
Residue:445
BDBM50222966
NameBDBM50222966
Synonyms:CHEMBL27545
TypeSmall organic molecule
Emp. Form.C26H34N2O3
Mol. Mass.422.5598
SMILESCC1CCN(CC1)C(=O)c1ccc(cc1)-c1ccc(OCCCN2CCOCC2)cc1