Reaction Details
TargetHistamine H2 receptor
LigandBDBM50404957
Substrate/Competitorn/a
Meas. Tech.ChEBML_84892
Ki 15849±n/a nM
Citation Hoffman, JMPietruszkiewicz, AMHabecker, CNPhillips, BTBolhofer, WACragoe, EJTorchiana, MLLumma, WCBaldwin, JJ Conformational requirements for histamine H2-receptor inhibitors: a structure-activity study of phenylene analogues related to cimetidine and tiotidine. J Med Chem26:140-4 (1983) Histamine H2 receptor
Name:Histamine H2 receptor
Type:G Protein-Coupled Receptor (GPCR)
Mol. Mass.:40567.22
Organism:Cavia porcellus (domestic guinea pig)
Description:For the H2 receptor-binding assays, guinea pig striatum was used.
Residue:359
BDBM50404957
NameBDBM50404957
Synonyms:CHEMBL33996
TypeSmall organic molecule
Emp. Form.C13H15N5O2
Mol. Mass.273.2905
SMILESCNC([CH-][N+]([O-])=O)=[NH+]c1cccc(c1)-c1nc[nH]c1C