Reaction Details
TargetAlpha-1A adrenergic receptor
LigandBDBM50408246
Substrate/Competitorn/a
Meas. Tech.ChEMBL_33595 (CHEMBL652804)
Ki 0.398107±n/a nM
Citation Elworthy, TRFord, APBantle, GWMorgans, DJOzer, RSPalmer, WSRepke, DBRomero, MSandoval, LSjogren, EBTalamás, FXVazquez, AWu, HArredondo, NFBlue, DRDeSousa, AGross, LMKava, MSLesnick, JDVimont, RLWilliams, TJZhu, QMPfister, JRClarke, DE N-arylpiperazinyl-N'-propylamino derivatives of heteroaryl amides as functional uroselective alpha 1-adrenoceptor antagonists. J Med Chem40:2674-87 (1997) 
 
Alpha-1A adrenergic receptor
Name:Alpha-1A adrenergic receptor
Type:Enzyme Catalytic Domain
Mol. Mass.:51492.08
Organism:CALF
Description:adrenergic Alpha1 0 CALF
Residue:466
BDBM50408246
NameBDBM50408246
Synonyms:CHEMBL92261
TypeSmall organic molecule
Emp. Form.C24H34N4O2
Mol. Mass.410.5524
SMILESCOc1ccccc1N1CCN(CCCNc2ncccc2C(=O)C(C)(C)C)CC1